Reaction Details
TargetPlatelet-derived growth factor receptor beta
LigandBDBM50429671
Substrate/Competitorn/a
Meas. Tech.ChEMBL_946706 (CHEMBL2343566)
IC50>500000±n/a nM
Citation Gangjee, ANamjoshi, OAYu, JIhnat, MAThorpe, JEBailey-Downs, LC N2-Trimethylacetyl substituted and unsubstituted-N4-phenylsubstituted-6-(2-pyridin-2-ylethyl)-7H-pyrrolo[2,3-d]pyrimidine-2,4-diamines: design, cellular receptor tyrosine kinase inhibitory activities and in vivo evaluation as antiangiogenic, antimetastatic and antitumor agents. Bioorg Med Chem21:1312-23 (2013) 
 
Platelet-derived growth factor receptor beta
Name:Platelet-derived growth factor receptor beta
Type:Enzyme
Mol. Mass.:123922.25
Organism:Homo sapiens (Human)
Description:P09619
Residue:1106
BDBM50429671
NameBDBM50429671
Synonyms:CHEMBL2335014
TypeSmall organic molecule
Emp. Form.C20H16F4N6
Mol. Mass.416.3749
SMILESNc1nc(Nc2ccc(F)c(c2)C(F)(F)F)c2cc(CCc3ccccn3)[nH]c2n1