Reaction Details
TargetEpidermal growth factor receptor
LigandBDBM50429675
Substrate/Competitorn/a
Meas. Tech.ChEMBL_946709 (CHEMBL2343569)
IC50 300±n/a nM
Citation Gangjee, ANamjoshi, OAYu, JIhnat, MAThorpe, JEBailey-Downs, LC N2-Trimethylacetyl substituted and unsubstituted-N4-phenylsubstituted-6-(2-pyridin-2-ylethyl)-7H-pyrrolo[2,3-d]pyrimidine-2,4-diamines: design, cellular receptor tyrosine kinase inhibitory activities and in vivo evaluation as antiangiogenic, antimetastatic and antitumor agents. Bioorg Med Chem21:1312-23 (2013) 
 
Epidermal growth factor receptor
Name:Epidermal growth factor receptor
Type:Receptor Kinase Domain
Mol. Mass.:134279.59
Organism:Homo sapiens (Human)
Description:P00533
Residue:1210
BDBM50429675
NameBDBM50429675
Synonyms:CHEMBL2335376
TypeSmall organic molecule
Emp. Form.C19H17BrN6
Mol. Mass.409.282
SMILESNc1nc(Nc2cccc(Br)c2)c2cc(CCc3ccccn3)[nH]c2n1