Reaction Details
TargetProtein S100-B
LigandBDBM34166
Substrate/Competitorn/a
Meas. Tech.ChEMBL_947124 (CHEMBL2341094)
IC50 2000±n/a nM
Citation Yoshimura, CMiyafusa, TTsumoto, K Identification of small-molecule inhibitors of the human S100B-p53 interaction and evaluation of their activity in human melanoma cells. Bioorg Med Chem21:1109-15 (2013) 
 
Protein S100-B
Name:Protein S100-B
Type:PROTEIN
Mol. Mass.:10701.34
Organism:Homo sapiens (Human)
Description:ChEMBL_947124
Residue:92
BDBM34166
NameBDBM34166
Synonyms:(2,4-dipiperidinophenyl)amine 2,4-bis(1-piperidinyl)aniline MLS000033228 cid_655480
TypeSmall organic molecule
Emp. Form.C16H25N3
Mol. Mass.259.3898
SMILESNc1ccc(cc1N1CCCCC1)N1CCCCC1