Reaction Details
TargetPotassium voltage-gated channel subfamily H member 2
LigandBDBM50429701
Substrate/Competitorn/a
Meas. Tech.ChEMBL_948139 (CHEMBL2338825)
IC50 47500±n/a nM
Citation Pike, KGMalagu, KHummersone, MGMenear, KADuggan, HMGomez, SMartin, NMRuston, LPass, SLPass, M Optimization of potent and selective dual mTORC1 and mTORC2 inhibitors: the discovery of AZD8055 and AZD2014. Bioorg Med Chem Lett23:1212-6 (2013) 
 
Potassium voltage-gated channel subfamily H member 2
Name:Potassium voltage-gated channel subfamily H member 2
Type:Multi-pass membrane protein
Mol. Mass.:126672.65
Organism:Homo sapiens (Human)
Description:Q12809
Residue:1159
BDBM50429701
NameBDBM50429701
Synonyms:AZD-2014 US9102670, 1ap
TypeSmall organic molecule
Emp. Form.C25H30N6O3
Mol. Mass.462.5441
SMILESCNC(=O)c1cccc(c1)-c1ccc2c(nc(nc2n1)N1CCOC[C@@H]1C)N1CCOC[C@@H]1C