Reaction Details
TargetAcetylcholinesterase
LigandBDBM50429786
Substrate/Competitorn/a
Meas. Tech.ChEMBL_948622 (CHEMBL2345138)
IC50 60±n/a nM
Citation Skrzypek, AMatysiak, JNiewiadomy, ABajda, MSzymanski, P Synthesis and biological evaluation of 1,3,4-thiadiazole analogues as novel AChE and BuChE inhibitors. Eur J Med Chem62:311-9 (2013) 
 
Acetylcholinesterase
Name:Acetylcholinesterase
Type:Enzyme
Mol. Mass.:71812.79
Organism:Electrophorus electricus (Electric eel)
Description:n/a
Residue:633
BDBM50429786
NameBDBM50429786
Synonyms:CHEMBL396226
TypeSmall organic molecule
Emp. Form.C14H9BrN2O2S
Mol. Mass.349.202
SMILESOc1ccc(-c2nnc(s2)-c2ccccc2Br)c(O)c1