Reaction Details
TargetCoagulation factor X
LigandBDBM50429812
Substrate/Competitorn/a
Meas. Tech.ChEMBL_948637 (CHEMBL2345153)
Ki 637±n/a nM
Citation Ilic, MDunkel, PIlaš, JChabielska, EZakrzeska, AMátyus, PKikelj, D Towards dual antithrombotic compounds - balancing thrombin inhibitory and fibrinogen GPIIb/IIIa binding inhibitory activities of 2,3-dihydro-1,4-benzodioxine derivatives through regio- and stereoisomerism. Eur J Med Chem62:329-40 (2013) 
 
Coagulation factor X
Name:Coagulation factor X
Type:Enzyme
Mol. Mass.:54726.60
Organism:Homo sapiens (Human)
Description:n/a
Residue:488
BDBM50429812
NameBDBM50429812
Synonyms:CHEMBL2337669
TypeSmall organic molecule
Emp. Form.C27H28N3O6
Mol. Mass.490.5272
SMILESCCOC(=O)C(=O)N(Cc1ccccc1)c1ccc2OC[C@@H](COc3ccc(cc3)C(N)=[NH2+])Oc2c1