Reaction Details
TargetA disintegrin and metalloproteinase with thrombospondin motifs 5
LigandBDBM50175548
Substrate/Competitorn/a
Meas. Tech.ChEMBL_948650 (CHEMBL2345166)
Ki 840±n/a nM
Citation Nuti, ESantamaria, SCasalini, FYamamoto, KMarinelli, LLa Pietra, VNovellino, EOrlandini, ENencetti, SMarini, AMSalerno, STaliani, SDa Settimo, FNagase, HRossello, A Arylsulfonamide inhibitors of aggrecanases as potential therapeutic agents for osteoarthritis: synthesis and biological evaluation. Eur J Med Chem62:379-94 (2013) 
 
A disintegrin and metalloproteinase with thrombospondin motifs 5
Name:A disintegrin and metalloproteinase with thrombospondin motifs 5
Type:Enzyme
Mol. Mass.:101769.09
Organism:Homo sapiens (Human)
Description:Q9UNA0
Residue:930
BDBM50175548
NameBDBM50175548
Synonyms:CHEMBL198778 | N-Hydroxy-2-(4-phenoxy-benzenesulfonylamino)-acetamide
TypeSmall organic molecule
Emp. Form.C14H14N2O5S
Mol. Mass.322.336
SMILESONC(=O)CNS(=O)(=O)c1ccc(Oc2ccccc2)cc1