Reaction Details
TargetCannabinoid receptor 1
LigandBDBM50429824
Substrate/Competitorn/a
Meas. Tech.ChEMBL_949080 (CHEMBL2343733)
EC50>10000±n/a nM
Citation Nettekoven, MFingerle, JGrether, UGrüner, SKimbara, APüllmann, BRogers-Evans, MRöver, SSchuler, FSchulz-Gasch, TUllmer, C Highly potent and selective cannabinoid receptor 2 agonists: initial hit optimization of an adamantyl hit series identified from high-through-put screening. Bioorg Med Chem Lett23:1177-81 (2013) 
 
Cannabinoid receptor 1
Name:Cannabinoid receptor 1
Type:Enzyme
Mol. Mass.:52842.52
Organism:Mus musculus (Mouse)
Description:P47746
Residue:473
BDBM50429824
NameBDBM50429824
Synonyms:CHEMBL2338188
TypeSmall organic molecule
Emp. Form.C19H23NO
Mol. Mass.281.392
SMILESO=C(C1C2CC3CC(C2)CC1C3)N1CCc2ccccc12