Reaction Details
TargetCannabinoid receptor 1
LigandBDBM50429825
Substrate/Competitorn/a
Meas. Tech.ChEMBL_949080 (CHEMBL2343733)
EC50>10000±n/a nM
Citation Nettekoven, MFingerle, JGrether, UGrüner, SKimbara, APüllmann, BRogers-Evans, MRöver, SSchuler, FSchulz-Gasch, TUllmer, C Highly potent and selective cannabinoid receptor 2 agonists: initial hit optimization of an adamantyl hit series identified from high-through-put screening. Bioorg Med Chem Lett23:1177-81 (2013) 
 
Cannabinoid receptor 1
Name:Cannabinoid receptor 1
Type:Enzyme
Mol. Mass.:52842.52
Organism:Mus musculus (Mouse)
Description:P47746
Residue:473
BDBM50429825
NameBDBM50429825
Synonyms:CHEMBL2338187
TypeSmall organic molecule
Emp. Form.C18H21NO
Mol. Mass.267.3654
SMILESO=C(N1CCc2ccccc12)C12CC3CC1CC(C2)C3