Reaction Details
TargetCannabinoid receptor 1
LigandBDBM50429826
Substrate/Competitorn/a
Meas. Tech.ChEMBL_949080 (CHEMBL2343733)
EC50>10000±n/a nM
Citation Nettekoven, MFingerle, JGrether, UGrüner, SKimbara, APüllmann, BRogers-Evans, MRöver, SSchuler, FSchulz-Gasch, TUllmer, C Highly potent and selective cannabinoid receptor 2 agonists: initial hit optimization of an adamantyl hit series identified from high-through-put screening. Bioorg Med Chem Lett23:1177-81 (2013) 
 
Cannabinoid receptor 1
Name:Cannabinoid receptor 1
Type:Enzyme
Mol. Mass.:52842.52
Organism:Mus musculus (Mouse)
Description:P47746
Residue:473
BDBM50429826
NameBDBM50429826
Synonyms:CHEMBL2338186
TypeSmall organic molecule
Emp. Form.C19H24N2O
Mol. Mass.296.4067
SMILESO=C(NC12CC3CC(CC(C3)C1)C2)N1Cc2ccccc2C1