Reaction Details
TargetCannabinoid receptor 2
LigandBDBM50429827
Substrate/Competitorn/a
Meas. Tech.ChEMBL_949086 (CHEMBL2343739)
EC50 1600±n/a nM
Citation Nettekoven, MFingerle, JGrether, UGrüner, SKimbara, APüllmann, BRogers-Evans, MRöver, SSchuler, FSchulz-Gasch, TUllmer, C Highly potent and selective cannabinoid receptor 2 agonists: initial hit optimization of an adamantyl hit series identified from high-through-put screening. Bioorg Med Chem Lett23:1177-81 (2013) 
 
Cannabinoid receptor 2
Name:Cannabinoid receptor 2
Type:G Protein-Coupled Receptor (GPCR)
Mol. Mass.:39690.94
Organism:Homo sapiens (Human)
Description:P34972
Residue:360
BDBM50429827
NameBDBM50429827
Synonyms:CHEMBL2338185
TypeSmall organic molecule
Emp. Form.C20H25NO
Mol. Mass.295.4186
SMILESCc1cccc2CCN(C(=O)C34CC5CC(CC(C5)C3)C4)c12