Reaction Details
TargetCannabinoid receptor 2
LigandBDBM50429844
Substrate/Competitorn/a
Meas. Tech.ChEMBL_949086 (CHEMBL2343739)
EC50 500±n/a nM
Citation Nettekoven, MFingerle, JGrether, UGrüner, SKimbara, APüllmann, BRogers-Evans, MRöver, SSchuler, FSchulz-Gasch, TUllmer, C Highly potent and selective cannabinoid receptor 2 agonists: initial hit optimization of an adamantyl hit series identified from high-through-put screening. Bioorg Med Chem Lett23:1177-81 (2013) 
 
Cannabinoid receptor 2
Name:Cannabinoid receptor 2
Type:G Protein-Coupled Receptor (GPCR)
Mol. Mass.:39690.94
Organism:Homo sapiens (Human)
Description:P34972
Residue:360
BDBM50429844
NameBDBM50429844
Synonyms:CHEMBL1422818
TypeSmall organic molecule
Emp. Form.C17H26N2OS
Mol. Mass.306.466
SMILESO=C(NC(=S)N1CCCCC1)C12CC3CC(CC(C3)C1)C2