Reaction Details
TargetCannabinoid receptor 2
LigandBDBM50429828
Substrate/Competitorn/a
Meas. Tech.ChEMBL_949087 (CHEMBL2343740)
EC50 15±n/a nM
Citation Nettekoven, MFingerle, JGrether, UGrüner, SKimbara, APüllmann, BRogers-Evans, MRöver, SSchuler, FSchulz-Gasch, TUllmer, C Highly potent and selective cannabinoid receptor 2 agonists: initial hit optimization of an adamantyl hit series identified from high-through-put screening. Bioorg Med Chem Lett23:1177-81 (2013) 
 
Cannabinoid receptor 2
Name:Cannabinoid receptor 2
Type:G Protein-Coupled Receptor (GPCR)
Mol. Mass.:39690.94
Organism:Homo sapiens (Human)
Description:P34972
Residue:360
BDBM50429828
NameBDBM50429828
Synonyms:CHEMBL2338184
TypeSmall organic molecule
Emp. Form.C20H22F3NO
Mol. Mass.349.39
SMILESFC(F)(F)c1ccc2CCN(C(=O)C34CC5CC(CC(C5)C3)C4)c2c1