Reaction Details
TargetCannabinoid receptor 2
LigandBDBM50429836
Substrate/Competitorn/a
Meas. Tech.ChEMBL_949087 (CHEMBL2343740)
EC50 1.8±n/a nM
Citation Nettekoven, MFingerle, JGrether, UGrüner, SKimbara, APüllmann, BRogers-Evans, MRöver, SSchuler, FSchulz-Gasch, TUllmer, C Highly potent and selective cannabinoid receptor 2 agonists: initial hit optimization of an adamantyl hit series identified from high-through-put screening. Bioorg Med Chem Lett23:1177-81 (2013) 
 
Cannabinoid receptor 2
Name:Cannabinoid receptor 2
Type:G Protein-Coupled Receptor (GPCR)
Mol. Mass.:39690.94
Organism:Homo sapiens (Human)
Description:P34972
Residue:360
BDBM50429836
NameBDBM50429836
Synonyms:CHEMBL2338175
TypeSmall organic molecule
Emp. Form.C22H29NO2
Mol. Mass.339.4712
SMILESCCOC1CCN(C(=O)C23CC4CC(CC(C4)C2)C3)c2ccccc12