Reaction Details
TargetCannabinoid receptor 2
LigandBDBM50429832
Substrate/Competitorn/a
Meas. Tech.ChEMBL_949081 (CHEMBL2343734)
Ki 900±n/a nM
Citation Nettekoven, MFingerle, JGrether, UGrüner, SKimbara, APüllmann, BRogers-Evans, MRöver, SSchuler, FSchulz-Gasch, TUllmer, C Highly potent and selective cannabinoid receptor 2 agonists: initial hit optimization of an adamantyl hit series identified from high-through-put screening. Bioorg Med Chem Lett23:1177-81 (2013) 
 
Cannabinoid receptor 2
Name:Cannabinoid receptor 2
Type:Enzyme Catalytic Domain
Mol. Mass.:38220.43
Organism:MOUSE
Description:P47936
Residue:347
BDBM50429832
NameBDBM50429832
Synonyms:CHEMBL2338179
TypeSmall organic molecule
Emp. Form.C19H23NO
Mol. Mass.281.392
SMILESO=C(N1Cc2ccccc2C1)C12CC3CC(CC(C3)C1)C2