Reaction Details
TargetCannabinoid receptor 2
LigandBDBM50207795
Substrate/Competitorn/a
Meas. Tech.ChEMBL_949081 (CHEMBL2343734)
Ki 4300±n/a nM
Citation Nettekoven, MFingerle, JGrether, UGrüner, SKimbara, APüllmann, BRogers-Evans, MRöver, SSchuler, FSchulz-Gasch, TUllmer, C Highly potent and selective cannabinoid receptor 2 agonists: initial hit optimization of an adamantyl hit series identified from high-through-put screening. Bioorg Med Chem Lett23:1177-81 (2013) 
 
Cannabinoid receptor 2
Name:Cannabinoid receptor 2
Type:Enzyme Catalytic Domain
Mol. Mass.:38220.43
Organism:MOUSE
Description:P47936
Residue:347
BDBM50207795
NameBDBM50207795
Synonyms:CHEMBL246952 | adamantan-1-yl-(3,4-dihydro-2H-quinolin-1-yl)-methanone
TypeSmall organic molecule
Emp. Form.C20H25NO
Mol. Mass.295.4186
SMILESO=C(N1CCCc2ccccc12)C12CC3CC(CC(C3)C1)C2