Reaction Details
TargetProtein kinase C zeta type
LigandBDBM50429867
Substrate/Competitorn/a
Meas. Tech.ChEMBL_944218 (CHEMBL2343425)
IC50>10000±n/a nM
Citation Takeuchi, CSKim, BGBlazey, CMMa, SJohnson, HWAnand, NKArcalas, ABaik, TGBuhr, CACannoy, JEpshteyn, SJoshi, ALara, KLee, MSWang, LLeahy, JWNuss, JMAay, NAoyama, RFoster, PLee, JLehoux, IMunagala, NPlonowski, ARajan, SWoolfrey, JYamaguchi, KLamb, PMiller, N Discovery of a novel class of highly potent, selective, ATP-competitive, and orally bioavailable inhibitors of the mammalian target of rapamycin (mTOR). J Med Chem56:2218-34 (2013) 
 
Protein kinase C zeta type
Name:Protein kinase C zeta type
Type:Enzyme
Mol. Mass.:67649.13
Organism:Homo sapiens (Human)
Description:n/a
Residue:592
BDBM50429867
NameBDBM50429867
Synonyms:CHEMBL2333365
TypeSmall organic molecule
Emp. Form.C23H22FN3O4S
Mol. Mass.455.502
SMILESCc1c(F)c(ccc1C(=O)N1CCOc2ccc(cc2C1)-c1ccc(N)nc1)S(C)(=O)=O