Reaction Details
TargetCalcium/calmodulin-dependent protein kinase type 1
LigandBDBM50429867
Substrate/Competitorn/a
Meas. Tech.ChEMBL_944285 (CHEMBL2343935)
IC50>10000±n/a nM
Citation Takeuchi, CSKim, BGBlazey, CMMa, SJohnson, HWAnand, NKArcalas, ABaik, TGBuhr, CACannoy, JEpshteyn, SJoshi, ALara, KLee, MSWang, LLeahy, JWNuss, JMAay, NAoyama, RFoster, PLee, JLehoux, IMunagala, NPlonowski, ARajan, SWoolfrey, JYamaguchi, KLamb, PMiller, N Discovery of a novel class of highly potent, selective, ATP-competitive, and orally bioavailable inhibitors of the mammalian target of rapamycin (mTOR). J Med Chem56:2218-34 (2013) 
 
Calcium/calmodulin-dependent protein kinase type 1
Name:Calcium/calmodulin-dependent protein kinase type 1
Type:PROTEIN
Mol. Mass.:41325.04
Organism:Homo sapiens (Human)
Description:ChEMBL_655701
Residue:370
BDBM50429867
NameBDBM50429867
Synonyms:CHEMBL2333365
TypeSmall organic molecule
Emp. Form.C23H22FN3O4S
Mol. Mass.455.502
SMILESCc1c(F)c(ccc1C(=O)N1CCOc2ccc(cc2C1)-c1ccc(N)nc1)S(C)(=O)=O