Reaction Details
TargetCarbonic anhydrase 2
LigandBDBM50429899
Substrate/Competitorn/a
Meas. Tech.ChEMBL_945271 (CHEMBL2340003)
Ki 3.5±n/a nM
Citation Dudutiene, VZubriene, ASmirnov, AGylyte, JTimm, DManakova, EGražulis, SMatulis, D 4-Substituted-2,3,5,6-tetrafluorobenzenesulfonamides as inhibitors of carbonic anhydrases I, II, VII, XII, and XIII. Bioorg Med Chem21:2093-106 (2013) 
 
Carbonic anhydrase 2
Name:Carbonic anhydrase 2
Type:Enzyme
Mol. Mass.:29250.71
Organism:Homo sapiens (Human)
Description:P00918
Residue:260
BDBM50429899
NameBDBM50429899
Synonyms:CHEMBL2333416
TypeSmall organic molecule
Emp. Form.C8H7F4NO3S2
Mol. Mass.305.27
SMILESNS(=O)(=O)c1c(F)c(F)c(SCCO)c(F)c1F