Reaction Details
TargetCarbonic anhydrase 13
LigandBDBM50429899
Substrate/Competitorn/a
Meas. Tech.ChEMBL_945272 (CHEMBL2340004)
pH7±n/a
Kd 18±n/a nM
Commentsextracted
Citation Dudutiene, VZubriene, ASmirnov, AGylyte, JTimm, DManakova, EGražulis, SMatulis, D 4-Substituted-2,3,5,6-tetrafluorobenzenesulfonamides as inhibitors of carbonic anhydrases I, II, VII, XII, and XIII. Bioorg Med Chem21:2093-106 (2013) 
 
Carbonic anhydrase 13
Name:Carbonic anhydrase 13
Type:Enzyme
Mol. Mass.:29445.78
Organism:Homo sapiens (Human)
Description:Q8N1Q1
Residue:262
BDBM50429899
NameBDBM50429899
Synonyms:CHEMBL2333416
TypeSmall organic molecule
Emp. Form.C8H7F4NO3S2
Mol. Mass.305.27
SMILESNS(=O)(=O)c1c(F)c(F)c(SCCO)c(F)c1F