Reaction Details
TargetCarbonic anhydrase 12
LigandBDBM50429900
Substrate/Competitorn/a
Meas. Tech.ChEMBL_945273 (CHEMBL2340471)
pH7±n/a
Kd 143±n/a nM
Commentsextracted
Citation Dudutiene, VZubriene, ASmirnov, AGylyte, JTimm, DManakova, EGražulis, SMatulis, D 4-Substituted-2,3,5,6-tetrafluorobenzenesulfonamides as inhibitors of carbonic anhydrases I, II, VII, XII, and XIII. Bioorg Med Chem21:2093-106 (2013) 
 
Carbonic anhydrase 12
Name:Carbonic anhydrase 12
Type:Enzyme
Mol. Mass.:39456.00
Organism:Homo sapiens (Human)
Description:Catalytic domain of human cloned isozyme was used in the assay
Residue:354
BDBM50429900
NameBDBM50429900
Synonyms:CHEMBL2333417
TypeSmall organic molecule
Emp. Form.C8H7F4NO5S2
Mol. Mass.337.268
SMILESNS(=O)(=O)c1c(F)c(F)c(c(F)c1F)S(=O)(=O)CCO