Reaction Details
TargetCarbonic anhydrase 7
LigandBDBM50406452
Substrate/Competitorn/a
Meas. Tech.ChEMBL_945274 (CHEMBL2340472)
pH7±n/a
Kd 510±n/a nM
Commentsextracted
Citation Dudutiene, VZubriene, ASmirnov, AGylyte, JTimm, DManakova, EGražulis, SMatulis, D 4-Substituted-2,3,5,6-tetrafluorobenzenesulfonamides as inhibitors of carbonic anhydrases I, II, VII, XII, and XIII. Bioorg Med Chem21:2093-106 (2013) 
 
Carbonic anhydrase 7
Name:Carbonic anhydrase 7
Type:Enzyme
Mol. Mass.:29664.11
Organism:Homo sapiens (Human)
Description:Human cloned isozyme.
Residue:264
BDBM50406452
NameBDBM50406452
Synonyms:CHEMBL106848
TypeSmall organic molecule
Emp. Form.C8H11NO3S2
Mol. Mass.233.308
SMILESNS(=O)(=O)c1ccc(SCCO)cc1