Reaction Details
TargetCarbonic anhydrase 13
LigandBDBM50429904
Substrate/Competitorn/a
Meas. Tech.ChEMBL_945277 (CHEMBL2340475)
pH7±n/a
Kd 50±n/a nM
Commentsextracted
Citation Dudutiene, VZubriene, ASmirnov, AGylyte, JTimm, DManakova, EGražulis, SMatulis, D 4-Substituted-2,3,5,6-tetrafluorobenzenesulfonamides as inhibitors of carbonic anhydrases I, II, VII, XII, and XIII. Bioorg Med Chem21:2093-106 (2013) 
 
Carbonic anhydrase 13
Name:Carbonic anhydrase 13
Type:Enzyme
Mol. Mass.:29445.78
Organism:Homo sapiens (Human)
Description:Q8N1Q1
Residue:262
BDBM50429904
NameBDBM50429904
Synonyms:4-Propylthiobenzenesulfonamide | CHEMBL2333400
TypeSmall organic molecule
Emp. Form.C9H13NO2S2
Mol. Mass.231.335
SMILESCCCSc1ccc(cc1)S(N)(=O)=O