Reaction Details
TargetCarbonic anhydrase 13
LigandBDBM50429905
Substrate/Competitorn/a
Meas. Tech.ChEMBL_945277 (CHEMBL2340475)
pH7±n/a
Kd 2.0±n/a nM
Commentsextracted
Citation Dudutiene, VZubriene, ASmirnov, AGylyte, JTimm, DManakova, EGražulis, SMatulis, D 4-Substituted-2,3,5,6-tetrafluorobenzenesulfonamides as inhibitors of carbonic anhydrases I, II, VII, XII, and XIII. Bioorg Med Chem21:2093-106 (2013) 
 
Carbonic anhydrase 13
Name:Carbonic anhydrase 13
Type:Enzyme
Mol. Mass.:29445.78
Organism:Homo sapiens (Human)
Description:Q8N1Q1
Residue:262
BDBM50429905
NameBDBM50429905
Synonyms:CHEMBL2333399
TypeSmall organic molecule
Emp. Form.C21H13F4N3O2S2
Mol. Mass.479.47
SMILESNS(=O)(=O)c1c(F)c(F)c(Sc2nc(c([nH]2)-c2ccccc2)-c2ccccc2)c(F)c1F