Reaction Details
TargetCarbonic anhydrase 13
LigandBDBM50429911
Substrate/Competitorn/a
Meas. Tech.ChEMBL_945277 (CHEMBL2340475)
pH7±n/a
Kd 0.400000±n/a nM
Commentsextracted
Citation Dudutiene, VZubriene, ASmirnov, AGylyte, JTimm, DManakova, EGražulis, SMatulis, D 4-Substituted-2,3,5,6-tetrafluorobenzenesulfonamides as inhibitors of carbonic anhydrases I, II, VII, XII, and XIII. Bioorg Med Chem21:2093-106 (2013) 
 
Carbonic anhydrase 13
Name:Carbonic anhydrase 13
Type:Enzyme
Mol. Mass.:29445.78
Organism:Homo sapiens (Human)
Description:Q8N1Q1
Residue:262
BDBM50429911
NameBDBM50429911
Synonyms:CHEMBL2333407
TypeSmall organic molecule
Emp. Form.C14H11F4NO4S2
Mol. Mass.397.365
SMILESNS(=O)(=O)c1c(F)c(F)c(c(F)c1F)S(=O)(=O)CCc1ccccc1