Reaction Details
TargetCarbonic anhydrase 13
LigandBDBM50429925
Substrate/Competitorn/a
Meas. Tech.ChEMBL_945277 (CHEMBL2340475)
pH7±n/a
Kd 40±n/a nM
Commentsextracted
Citation Dudutiene, VZubriene, ASmirnov, AGylyte, JTimm, DManakova, EGražulis, SMatulis, D 4-Substituted-2,3,5,6-tetrafluorobenzenesulfonamides as inhibitors of carbonic anhydrases I, II, VII, XII, and XIII. Bioorg Med Chem21:2093-106 (2013) 
 
Carbonic anhydrase 13
Name:Carbonic anhydrase 13
Type:Enzyme
Mol. Mass.:29445.78
Organism:Homo sapiens (Human)
Description:Q8N1Q1
Residue:262
BDBM50429925
NameBDBM50429925
Synonyms:2,3,4,5,6-Pentafluorobenzenesulfonamide | CHEMBL2333413
TypeSmall organic molecule
Emp. Form.C6H2F5NO2S
Mol. Mass.247.143
SMILESNS(=O)(=O)c1c(F)c(F)c(F)c(F)c1F