Reaction Details
TargetCarbonic anhydrase 12
LigandBDBM50429918
Substrate/Competitorn/a
Meas. Tech.ChEMBL_945278 (CHEMBL2340476)
pH7±n/a
Kd 20±n/a nM
Commentsextracted
Citation Dudutiene, VZubriene, ASmirnov, AGylyte, JTimm, DManakova, EGražulis, SMatulis, D 4-Substituted-2,3,5,6-tetrafluorobenzenesulfonamides as inhibitors of carbonic anhydrases I, II, VII, XII, and XIII. Bioorg Med Chem21:2093-106 (2013) 
 
Carbonic anhydrase 12
Name:Carbonic anhydrase 12
Type:Enzyme
Mol. Mass.:39456.00
Organism:Homo sapiens (Human)
Description:Catalytic domain of human cloned isozyme was used in the assay
Residue:354
BDBM50429918
NameBDBM50429918
Synonyms:CHEMBL2333815
TypeSmall organic molecule
Emp. Form.C12H7F4NO2S2
Mol. Mass.337.313
SMILESNS(=O)(=O)c1c(F)c(F)c(Sc2ccccc2)c(F)c1F