Reaction Details
TargetCarbonic anhydrase 7
LigandBDBM50429902
Substrate/Competitorn/a
Meas. Tech.ChEMBL_945279 (CHEMBL2340477)
pH7±n/a
Kd 10.0±n/a nM
Commentsextracted
Citation Dudutiene, VZubriene, ASmirnov, AGylyte, JTimm, DManakova, EGražulis, SMatulis, D 4-Substituted-2,3,5,6-tetrafluorobenzenesulfonamides as inhibitors of carbonic anhydrases I, II, VII, XII, and XIII. Bioorg Med Chem21:2093-106 (2013) 
 
Carbonic anhydrase 7
Name:Carbonic anhydrase 7
Type:Enzyme
Mol. Mass.:29664.11
Organism:Homo sapiens (Human)
Description:Human cloned isozyme.
Residue:264
BDBM50429902
NameBDBM50429902
Synonyms:CHEMBL2333410
TypeSmall organic molecule
Emp. Form.C12H9F4N3O2S2
Mol. Mass.367.342
SMILESCc1cc(C)nc(Sc2c(F)c(F)c(c(F)c2F)S(N)(=O)=O)n1