Reaction Details
TargetCarbonic anhydrase 7
LigandBDBM50429909
Substrate/Competitorn/a
Meas. Tech.ChEMBL_945279 (CHEMBL2340477)
pH7±n/a
Kd 2.5±n/a nM
Commentsextracted
Citation Dudutiene, VZubriene, ASmirnov, AGylyte, JTimm, DManakova, EGražulis, SMatulis, D 4-Substituted-2,3,5,6-tetrafluorobenzenesulfonamides as inhibitors of carbonic anhydrases I, II, VII, XII, and XIII. Bioorg Med Chem21:2093-106 (2013) 
 
Carbonic anhydrase 7
Name:Carbonic anhydrase 7
Type:Enzyme
Mol. Mass.:29664.11
Organism:Homo sapiens (Human)
Description:Human cloned isozyme.
Residue:264
BDBM50429909
NameBDBM50429909
Synonyms:CHEMBL2333409
TypeSmall organic molecule
Emp. Form.C16H15F4NO2S2
Mol. Mass.393.419
SMILESCc1cc(C)c(CSc2c(F)c(F)c(c(F)c2F)S(N)(=O)=O)c(C)c1