Reaction Details
TargetCarbonic anhydrase 7
LigandBDBM50429914
Substrate/Competitorn/a
Meas. Tech.ChEMBL_945279 (CHEMBL2340477)
pH7±n/a
Kd 133±n/a nM
Commentsextracted
Citation Dudutiene, VZubriene, ASmirnov, AGylyte, JTimm, DManakova, EGražulis, SMatulis, D 4-Substituted-2,3,5,6-tetrafluorobenzenesulfonamides as inhibitors of carbonic anhydrases I, II, VII, XII, and XIII. Bioorg Med Chem21:2093-106 (2013) 
 
Carbonic anhydrase 7
Name:Carbonic anhydrase 7
Type:Enzyme
Mol. Mass.:29664.11
Organism:Homo sapiens (Human)
Description:Human cloned isozyme.
Residue:264
BDBM50429914
NameBDBM50429914
Synonyms:CHEMBL2333404
TypeSmall organic molecule
Emp. Form.C13H10F4N2O2S
Mol. Mass.334.289
SMILESNS(=O)(=O)c1c(F)c(F)c(NCc2ccccc2)c(F)c1F