Reaction Details
TargetCarbonic anhydrase 2
LigandBDBM50429910
Substrate/Competitorn/a
Meas. Tech.ChEMBL_945280 (CHEMBL2340478)
pH7±n/a
Kd 18±n/a nM
Commentsextracted
Citation Dudutiene, VZubriene, ASmirnov, AGylyte, JTimm, DManakova, EGražulis, SMatulis, D 4-Substituted-2,3,5,6-tetrafluorobenzenesulfonamides as inhibitors of carbonic anhydrases I, II, VII, XII, and XIII. Bioorg Med Chem21:2093-106 (2013) 
 
Carbonic anhydrase 2
Name:Carbonic anhydrase 2
Type:Enzyme
Mol. Mass.:29250.71
Organism:Homo sapiens (Human)
Description:P00918
Residue:260
BDBM50429910
NameBDBM50429910
Synonyms:CHEMBL2333408
TypeSmall organic molecule
Emp. Form.C10H10F4N2O3S
Mol. Mass.314.257
SMILESNS(=O)(=O)c1c(F)c(F)c(N2CCOCC2)c(F)c1F