Reaction Details
TargetCarbonic anhydrase 2
LigandBDBM50429917
Substrate/Competitorn/a
Meas. Tech.ChEMBL_945280 (CHEMBL2340478)
pH7±n/a
Kd 3.3±n/a nM
Commentsextracted
Citation Dudutiene, VZubriene, ASmirnov, AGylyte, JTimm, DManakova, EGražulis, SMatulis, D 4-Substituted-2,3,5,6-tetrafluorobenzenesulfonamides as inhibitors of carbonic anhydrases I, II, VII, XII, and XIII. Bioorg Med Chem21:2093-106 (2013) 
 
Carbonic anhydrase 2
Name:Carbonic anhydrase 2
Type:Enzyme
Mol. Mass.:29250.71
Organism:Homo sapiens (Human)
Description:P00918
Residue:260
BDBM50429917
NameBDBM50429917
Synonyms:CHEMBL2333816
TypeSmall organic molecule
Emp. Form.C12H7F4NO4S2
Mol. Mass.369.312
SMILESNS(=O)(=O)c1c(F)c(F)c(c(F)c1F)S(=O)(=O)c1ccccc1