Reaction Details
TargetCarbonic anhydrase 1
LigandBDBM50429924
Substrate/Competitorn/a
Meas. Tech.ChEMBL_945281 (CHEMBL2340479)
pH7±n/a
Kd 8.3±n/a nM
Commentsextracted
Citation Dudutiene, VZubriene, ASmirnov, AGylyte, JTimm, DManakova, EGražulis, SMatulis, D 4-Substituted-2,3,5,6-tetrafluorobenzenesulfonamides as inhibitors of carbonic anhydrases I, II, VII, XII, and XIII. Bioorg Med Chem21:2093-106 (2013) 
 
Carbonic anhydrase 1
Name:Carbonic anhydrase 1
Type:Enzyme
Mol. Mass.:28873.37
Organism:Homo sapiens (Human)
Description:P00915
Residue:261
BDBM50429924
NameBDBM50429924
Synonyms:CHEMBL2333414
TypeSmall organic molecule
Emp. Form.C6H5F4N3O2S
Mol. Mass.259.181
SMILESNNc1c(F)c(F)c(c(F)c1F)S(N)(=O)=O