Reaction Details
TargetCarbonic anhydrase 1
LigandBDBM50429901
Substrate/Competitorn/a
Meas. Tech.ChEMBL_945281 (CHEMBL2340479)
pH7±n/a
Kd 2.4±n/a nM
Commentsextracted
Citation Dudutiene, VZubriene, ASmirnov, AGylyte, JTimm, DManakova, EGražulis, SMatulis, D 4-Substituted-2,3,5,6-tetrafluorobenzenesulfonamides as inhibitors of carbonic anhydrases I, II, VII, XII, and XIII. Bioorg Med Chem21:2093-106 (2013) 
 
Carbonic anhydrase 1
Name:Carbonic anhydrase 1
Type:Enzyme
Mol. Mass.:28873.37
Organism:Homo sapiens (Human)
Description:P00915
Residue:261
BDBM50429901
NameBDBM50429901
Synonyms:2,3,5,6-Tetrafluorobenzenesulfonamide | CHEMBL2333412
TypeSmall organic molecule
Emp. Form.C6H3F4NO2S
Mol. Mass.229.152
SMILESNS(=O)(=O)c1c(F)c(F)cc(F)c1F