Reaction Details
TargetCarbonic anhydrase 1
LigandBDBM50429927
Substrate/Competitorn/a
Meas. Tech.ChEMBL_945283 (CHEMBL2340481)
Ki 450±n/a nM
Citation Akincioglu, AAkbaba, YGöçer, HGöksu, SGülçin, ISupuran, CT Novel sulfamides as potential carbonic anhydrase isoenzymes inhibitors. Bioorg Med Chem21:1379-85 (2013) 
 
Carbonic anhydrase 1
Name:Carbonic anhydrase 1
Type:Enzyme
Mol. Mass.:28873.37
Organism:Homo sapiens (Human)
Description:P00915
Residue:261
BDBM50429927
NameBDBM50429927
Synonyms:CHEMBL2333818
TypeSmall organic molecule
Emp. Form.C9H12N2O2S
Mol. Mass.212.269
SMILESNS(=O)(=O)NC1CCc2ccccc12