Reaction Details
TargetCarbonic anhydrase 2
LigandBDBM50429927
Substrate/Competitorn/a
Meas. Tech.ChEMBL_945282 (CHEMBL2340480)
Ki 1070±n/a nM
Citation Akincioglu, AAkbaba, YGöçer, HGöksu, SGülçin, ISupuran, CT Novel sulfamides as potential carbonic anhydrase isoenzymes inhibitors. Bioorg Med Chem21:1379-85 (2013) 
 
Carbonic anhydrase 2
Name:Carbonic anhydrase 2
Type:Enzyme
Mol. Mass.:29250.71
Organism:Homo sapiens (Human)
Description:P00918
Residue:260
BDBM50429927
NameBDBM50429927
Synonyms:CHEMBL2333818
TypeSmall organic molecule
Emp. Form.C9H12N2O2S
Mol. Mass.212.269
SMILESNS(=O)(=O)NC1CCc2ccccc12