Reaction Details
TargetLysophosphatidic acid receptor 6
LigandBDBM50381022
Substrate/Competitorn/a
Meas. Tech.ChEMBL_946255 (CHEMBL2344993)
EC50 86±n/a nM
Citation Jiang, GInoue, AAoki, JPrestwich, GD Phosphorothioate analogs of sn-2 radyl lysophosphatidic acid (LPA): metabolically stabilized LPA receptor agonists. Bioorg Med Chem Lett23:1865-9 (2013) 
 
Lysophosphatidic acid receptor 6
Name:Lysophosphatidic acid receptor 6
Type:PROTEIN
Mol. Mass.:39408.81
Organism:Homo sapiens (Human)
Description:ChEMBL_946255
Residue:344
BDBM50381022
NameBDBM50381022
Synonyms:CHEMBL2017139
TypeSmall organic molecule
Emp. Form.C22H45O6PS
Mol. Mass.468.628
(=O)OCC(COP(O)(S)=O)OC