Reaction Details
TargetLysophosphatidic acid receptor 6
LigandBDBM50430007
Substrate/Competitorn/a
Meas. Tech.ChEMBL_946255 (CHEMBL2344993)
EC50 76±n/a nM
Citation Jiang, GInoue, AAoki, JPrestwich, GD Phosphorothioate analogs of sn-2 radyl lysophosphatidic acid (LPA): metabolically stabilized LPA receptor agonists. Bioorg Med Chem Lett23:1865-9 (2013) 
 
Lysophosphatidic acid receptor 6
Name:Lysophosphatidic acid receptor 6
Type:PROTEIN
Mol. Mass.:39408.81
Organism:Homo sapiens (Human)
Description:ChEMBL_946255
Residue:344
BDBM50430007
NameBDBM50430007
Synonyms:CHEMBL2335051
TypeSmall organic molecule
Emp. Form.C22H44O6PS
Mol. Mass.467.62
(=O)OC(COC)COP(O)([O-])=S