Reaction Details
TargetLysophosphatidic acid receptor 3
LigandBDBM50430010
Substrate/Competitorn/a
Meas. Tech.ChEMBL_946258 (CHEMBL2344996)
EC50 0.370000±n/a nM
Citation Jiang, GInoue, AAoki, JPrestwich, GD Phosphorothioate analogs of sn-2 radyl lysophosphatidic acid (LPA): metabolically stabilized LPA receptor agonists. Bioorg Med Chem Lett23:1865-9 (2013) 
 
Lysophosphatidic acid receptor 3
Name:Lysophosphatidic acid receptor 3
Type:Enzyme
Mol. Mass.:40149.72
Organism:Homo sapiens (Human)
Description:Q9UBY5
Residue:353
BDBM50430010
NameBDBM50430010
Synonyms:CHEMBL2335047
TypeSmall organic molecule
Emp. Form.C22H47O5PS
Mol. Mass.454.644
[C@@H](COP(O)(O)=S)OC