Reaction Details
TargetCalcitonin gene-related peptide type 1 receptor
LigandBDBM50430061
Substrate/Competitorn/a
Meas. Tech.ChEMBL_949161 (CHEMBL2344728)
Ki 0.011000±n/a nM
Citation Han, XCiviello, RLConway, CMCook, DADavis, CDDegnan, APJiang, XJMacci, RMathias, NRMoench, PPin, SSSchartman, RSignor, LJThalody, GTora, GWhiterock, VXu, CMacor, JEDubowchik, GM The synthesis and SAR of calcitonin gene-related peptide (CGRP) receptor antagonists derived from tyrosine surrogates. Part 2. Bioorg Med Chem Lett23:1870-3 (2013) 
 
Calcitonin gene-related peptide type 1 receptor
Name:Calcitonin gene-related peptide type 1 receptor
Type:Enzyme Catalytic Domain
Mol. Mass.:52980.45
Organism:Homo sapiens (Human)
Description:Q16602
Residue:461
BDBM50430061
NameBDBM50430061
Synonyms:CHEMBL2336422
TypeSmall organic molecule
Emp. Form.C34H43ClN8O3
Mol. Mass.647.21
SMILESClc1cc(CC(NC(=O)N2CCC(CC2)N2Cc3ccccc3NC2=O)C(=O)N2CCC(CC2)N2CCCCC2)cc2cn[nH]c12