Reaction Details
TargetNAD-dependent histone deacetylase SIR2
LigandBDBM29590
Substrate/Competitorn/a
Meas. Tech.ChEMBL_942450 (CHEMBL2345217)
IC50 60000±n/a nM
Citation Rambabu, DRaja, GYogi Sreenivas, BSeerapu, GPLalith Kumar, KDeora, GSHaldar, DRao, MVPal, M Spiro heterocycles as potential inhibitors of SIRT1: Pd/C-mediated synthesis of novel N-indolylmethyl spiroindoline-3,2'-quinazolines. Bioorg Med Chem Lett23:1351-7 (2013) 
 
NAD-dependent histone deacetylase SIR2
Name:NAD-dependent histone deacetylase SIR2
Type:PROTEIN
Mol. Mass.:63277.80
Organism:Saccharomyces cerevisiae
Description:ChEMBL_942450
Residue:562
BDBM29590
NameBDBM29590
Synonyms:1,2-Dihydro-3H-naphtho[2,1-b]pyran-3-one splitomicin
TypeSmall organic molecule
Emp. Form.C13H10O2
Mol. Mass.198.2173
SMILESO=C1CCc2c(O1)ccc1ccccc21