Reaction Details
TargetReceptor-type tyrosine-protein kinase FLT3
LigandBDBM50049400
Substrate/Competitorn/a
Meas. Tech.ChEMBL_942896 (CHEMBL2342404)
IC50>10000±n/a nM
Citation Chin, YWKong, JYHan, SY Flavonoids as receptor tyrosine kinase FLT3 inhibitors. Bioorg Med Chem Lett23:1768-70 (2013) 
 
Receptor-type tyrosine-protein kinase FLT3
Name:Receptor-type tyrosine-protein kinase FLT3
Type:Enzyme
Mol. Mass.:112888.62
Organism:Homo sapiens (Human)
Description:P36888
Residue:993
BDBM50049400
NameBDBM50049400
Synonyms:(+/-) taxifolin (+/-)-taxifolin (2R,3R)-2-(3,4-dihydroxyphenyl)-3,5,7-trihydroxychroman-4-one 2-(3,4-dihydroxyphenyl)-3,5,7-trihydroxychroman-4-one CHEMBL337309 | NSC-2801
TypeSmall organic molecule
Emp. Form.C15H12O7
Mol. Mass.304.2516
SMILESOC1C(=O)C(Oc2cc(O)cc(O)c12)c1ccc(O)c(O)c1