Reaction Details
TargetReceptor-type tyrosine-protein kinase FLT3
LigandBDBM7458
Substrate/Competitorn/a
Meas. Tech.ChEMBL_942896 (CHEMBL2342404)
IC50 1450±n/a nM
Citation Chin, YWKong, JYHan, SY Flavonoids as receptor tyrosine kinase FLT3 inhibitors. Bioorg Med Chem Lett23:1768-70 (2013) 
 
Receptor-type tyrosine-protein kinase FLT3
Name:Receptor-type tyrosine-protein kinase FLT3
Type:Enzyme
Mol. Mass.:112888.62
Organism:Homo sapiens (Human)
Description:P36888
Residue:993
BDBM7458
NameBDBM7458
Synonyms:5,7-dihydroxy-2-(4-hydroxyphenyl)-4H-chromen-4-one Apigenin Apigenin (3) Apigenin, 13 Naringenin, 18 US11337935, Compound Apigenin cid_5280443 | jm5b01461, Compound 90
TypeSmall organic molecule
Emp. Form.C15H10O5
Mol. Mass.270.2369
SMILESOc1ccc(cc1)-c1cc(=O)c2c(O)cc(O)cc2o1