Reaction Details
TargetAurora kinase B
LigandBDBM50430288
Substrate/Competitorn/a
Meas. Tech.ChEMBL_943783 (CHEMBL2345796)
IC50>10000±n/a nM
Citation Tomita, NHayashi, YSuzuki, SOomori, YAramaki, YMatsushita, YIwatani, MIwata, HOkabe, AAwazu, YIsono, OSkene, RJHosfield, DJMiki, HKawamoto, THori, ABaba, A Structure-based discovery of cellular-active allosteric inhibitors of FAK. Bioorg Med Chem Lett23:1779-85 (2013) 
 
Aurora kinase B
Name:Aurora kinase B
Type:Protein
Mol. Mass.:39327.72
Organism:Homo sapiens (Human)
Description:Q96GD4
Residue:344
BDBM50430288
NameBDBM50430288
Synonyms:CHEMBL2333435
TypeSmall organic molecule
Emp. Form.C19H19N3O2S
Mol. Mass.353.438
SMILESCCc1ccc(cc1)-c1ccc2N(C)S(=O)(=O)c3cnn(C)c3-c2c1