Reaction Details
TargetProto-oncogene tyrosine-protein kinase Src
LigandBDBM50430287
Substrate/Competitorn/a
Meas. Tech.ChEMBL_943785 (CHEMBL2345798)
IC50>10000±n/a nM
Citation Tomita, NHayashi, YSuzuki, SOomori, YAramaki, YMatsushita, YIwatani, MIwata, HOkabe, AAwazu, YIsono, OSkene, RJHosfield, DJMiki, HKawamoto, THori, ABaba, A Structure-based discovery of cellular-active allosteric inhibitors of FAK. Bioorg Med Chem Lett23:1779-85 (2013) 
 
Proto-oncogene tyrosine-protein kinase Src
Name:Proto-oncogene tyrosine-protein kinase Src
Type:Protein
Mol. Mass.:59838.60
Organism:Homo sapiens (Human)
Description:P12931
Residue:536
BDBM50430287
NameBDBM50430287
Synonyms:CHEMBL2333444
TypeSmall organic molecule
Emp. Form.C22H26N4O2S
Mol. Mass.410.532
SMILESCN1c2ccc(NCc3ccc(cc3)C(C)(C)C)cc2-c2c(cnn2C)S1(=O)=O