Reaction Details
TargetFocal adhesion kinase 1
LigandBDBM50430291
Substrate/Competitorn/a
Meas. Tech.ChEMBL_943791 (CHEMBL2345804)
IC50 4300±n/a nM
Citation Tomita, NHayashi, YSuzuki, SOomori, YAramaki, YMatsushita, YIwatani, MIwata, HOkabe, AAwazu, YIsono, OSkene, RJHosfield, DJMiki, HKawamoto, THori, ABaba, A Structure-based discovery of cellular-active allosteric inhibitors of FAK. Bioorg Med Chem Lett23:1779-85 (2013) 
 
Focal adhesion kinase 1
Name:Focal adhesion kinase 1
Type:Tyrosine-protein kinase
Mol. Mass.:119233.17
Organism:Homo sapiens (Human)
Description:Q05397
Residue:1052
BDBM50430291
NameBDBM50430291
Synonyms:CHEMBL2333442
TypeSmall organic molecule
Emp. Form.C17H15FN4O2S
Mol. Mass.358.39
SMILESCN1c2ccc(Nc3ccc(F)cc3)cc2-c2c(cnn2C)S1(=O)=O