Reaction Details
TargetFocal adhesion kinase 1
LigandBDBM50430296
Substrate/Competitorn/a
Meas. Tech.ChEMBL_943791 (CHEMBL2345804)
IC50>30000±n/a nM
Citation Tomita, NHayashi, YSuzuki, SOomori, YAramaki, YMatsushita, YIwatani, MIwata, HOkabe, AAwazu, YIsono, OSkene, RJHosfield, DJMiki, HKawamoto, THori, ABaba, A Structure-based discovery of cellular-active allosteric inhibitors of FAK. Bioorg Med Chem Lett23:1779-85 (2013) 
 
Focal adhesion kinase 1
Name:Focal adhesion kinase 1
Type:Tyrosine-protein kinase
Mol. Mass.:119233.17
Organism:Homo sapiens (Human)
Description:Q05397
Residue:1052
BDBM50430296
NameBDBM50430296
Synonyms:CHEMBL2333437
TypeSmall organic molecule
Emp. Form.C19H19N3O2S
Mol. Mass.353.438
SMILESCCc1ccc(cc1)-c1ccc2N(C)S(=O)(=O)c3cn(C)nc3-c2c1