Reaction Details
TargetRho-associated protein kinase 2
LigandBDBM50430336
Substrate/Competitorn/a
Meas. Tech.ChEMBL_943818 (CHEMBL2346267)
IC50 52±n/a nM
Citation Chowdhury, SChen, YTFang, XGrant, WPocas, JCameron, MDRuiz, CLin, LPark, HSchröter, TBannister, TDLograsso, PVFeng, Y Amino acid derived quinazolines as Rock/PKA inhibitors. Bioorg Med Chem Lett23:1592-9 (2013) 
 
Rho-associated protein kinase 2
Name:Rho-associated protein kinase 2
Type:Protein
Mol. Mass.:160885.43
Organism:Homo sapiens (Human)
Description:O75116
Residue:1388
BDBM50430336
NameBDBM50430336
Synonyms:CHEMBL2334285
TypeSmall organic molecule
Emp. Form.C21H18N4O
Mol. Mass.342.3938
SMILESN[C@@H](Cc1ccccc1)c1nc2ccc(cc2c(=O)[nH]1)-c1ccncc1