Reaction Details
TargetRho-associated protein kinase 2
LigandBDBM50430351
Substrate/Competitorn/a
Meas. Tech.ChEMBL_943818 (CHEMBL2346267)
IC50 239±n/a nM
Citation Chowdhury, SChen, YTFang, XGrant, WPocas, JCameron, MDRuiz, CLin, LPark, HSchröter, TBannister, TDLograsso, PVFeng, Y Amino acid derived quinazolines as Rock/PKA inhibitors. Bioorg Med Chem Lett23:1592-9 (2013) 
 
Rho-associated protein kinase 2
Name:Rho-associated protein kinase 2
Type:Protein
Mol. Mass.:160885.43
Organism:Homo sapiens (Human)
Description:O75116
Residue:1388
BDBM50430351
NameBDBM50430351
Synonyms:CHEMBL2333903
TypeSmall organic molecule
Emp. Form.C26H21ClN6O2
Mol. Mass.484.937
SMILESClc1ccc(C[C@@H](NC(=O)Cc2cccnc2)c2nc3ccc(cc3c(=O)[nH]2)-c2cn[nH]c2)cc1