Reaction Details
TargetSerine/threonine-protein kinase MRCK alpha
LigandBDBM50430373
Substrate/Competitorn/a
Meas. Tech.ChEMBL_943803 (CHEMBL2346252)
IC50>1000±n/a nM
Citation Chowdhury, SChen, YTFang, XGrant, WPocas, JCameron, MDRuiz, CLin, LPark, HSchröter, TBannister, TDLograsso, PVFeng, Y Amino acid derived quinazolines as Rock/PKA inhibitors. Bioorg Med Chem Lett23:1592-9 (2013) 
 
Serine/threonine-protein kinase MRCK alpha
Name:Serine/threonine-protein kinase MRCK alpha
Type:Protien
Mol. Mass.:197305.74
Organism:Homo sapiens (Human)
Description:Q5VT25
Residue:1732
BDBM50430373
NameBDBM50430373
Synonyms:CHEMBL2334293
TypeSmall organic molecule
Emp. Form.C19H16ClN5O
Mol. Mass.365.816
SMILESN[C@@H](Cc1ccc(Cl)cc1)c1nc2ccc(cc2c(=O)[nH]1)-c1cn[nH]c1